Error from server (NotFound): namespaces "devfile-proxy" not found
Using Devfile proxy:
go install -mod=vendor -ldflags="-X github.com/redhat-developer/odo/pkg/version.GITCOMMIT=3ee965f1b" ./cmd/odo/
go run -mod=vendor github.com/onsi/ginkgo/v2/ginkgo  --randomize-all --poll-progress-after=120s --poll-progress-interval=120s -timeout 14400s --no-color -nodes=16 --junit-report="test-integration.xml" --label-filter="!unauth && !nocluster && !podman" tests/integration
Running Suite: Integration Suite - /go/odo_1/tests/integration
==============================================================
Random Seed: 1689920923 - will randomize all specs

Will run 505 of 958 specs
Running in parallel across 16 processes
SSSSSSSSSSSSSSSS•SSSSSSS•S•SSS•SSS•SS•SSSSSSS•••S•SSSS•SSS•••SSS•••SS•SSS•SSSS•••SS•SS•SS•S•SSS•
------------------------------
• [82.324 seconds]
odo dev interactive command tests directory is not empty when there is a match from Alizer should display welcoming messages first
/go/odo_1/tests/integration/interactive_dev_test.go:112

  Captured StdOut/StdErr Output >>
  Spawning '/go/bin/odo dev --random-ports' from /tmp/1744789430
  << Captured StdOut/StdErr Output
------------------------------
•S•SS••••••
------------------------------
• [3.053 seconds]
odo deploy interactive command tests directory is not empty when there is a match from Alizer should run alizer to download devfile
/go/odo_1/tests/integration/interactive_deploy_test.go:75

  Captured StdOut/StdErr Output >>
  Spawning '/go/bin/odo deploy' from /tmp/172943527
  << Captured StdOut/StdErr Output
------------------------------
SS•SS••SSS••SSSSSSSSS•S•S•S•••SSSS•••SS•S••SS•S•SSS•••••SS•S•S••SS•SSS••S•••S••SS••SS•SSSS••SS••SSSSS•
------------------------------
• [79.185 seconds]
odo dev interactive command tests directory is not empty when there is a match from Alizer should run alizer to download devfile successfully even with -v flag
/go/odo_1/tests/integration/interactive_dev_test.go:40

  Captured StdOut/StdErr Output >>
  Spawning '/go/bin/odo dev --random-ports -v 4' from /tmp/309461049
  << Captured StdOut/StdErr Output
------------------------------
• [7.496 seconds]
odo dev interactive command tests directory is not empty when Alizer cannot determine a Devfile based on the current source code should not fail but fallback to the interactive mode
/go/odo_1/tests/integration/interactive_dev_test.go:164

  Captured StdOut/StdErr Output >>
  Spawning '/go/bin/odo dev --random-ports' from /tmp/1905055025
  << Captured StdOut/StdErr Output
------------------------------
•••SSSSSSSS••••S•S•••SS••SS•SSSS•SSSSSSS••SSSSSS•S•SSSSS••S••S•SSS•
  ------------------------------
  Progress Report for Ginkgo Process #7
  Automatically polling progress:
    odo dev command tests checking if odo dev matches local Devfile K8s resources and remote resources when odo dev is executed to run a devfile containing a k8s resource with apply command should have deleted the old resource and created the new resource (Spec Runtime: 2m1.452s)
      /go/odo_1/tests/integration/cmd_dev_test.go:1047
      In [BeforeEach] (Node Runtime: 2m0.001s)
        /go/odo_1/tests/integration/cmd_dev_test.go:1020

      Begin Captured GinkgoWriter Output >>
        ...
        [odo] I0721 06:36:01.036317   18564 exec.go:96]   sl  local_address                         remote_address                        st tx_queue rx_queue tr tm->when retrnsmt   uid  timeout inode ref pointer drops
        [odo] I0721 06:36:01.036536   18564 port.go:319] port 8080 not listening in container "runtime"
        [odo] I0721 06:36:08.829423   18564 exec.go:37] Executing command [/bin/sh -c cat /proc/net/tcp /proc/net/udp /proc/net/tcp6 /proc/net/udp6 || true] for pod: adytop-app-6554884d9c-49tzc in container: runtime
        [odo] I0721 06:36:09.061938   18564 exec.go:96]   sl  local_address rem_address   st tx_queue rx_queue tr tm->when retrnsmt   uid  timeout inode                                                     
        [odo] I0721 06:36:09.061975   18564 exec.go:96]    0: 442E11AC:EA14 23151068:01BB 06 00000000:00000000 03:00000C05 00000000     0        0 0 3 0000000000000000                                      
        [odo] I0721 06:36:09.062254   18564 exec.go:96]   sl  local_address rem_address   st tx_queue rx_queue tr tm->when retrnsmt   uid  timeout inode ref pointer drops             
        [odo] I0721 06:36:09.062676   18564 exec.go:96]   sl  local_address                         remote_address                        st tx_queue rx_queue tr tm->when retrnsmt   uid  timeout inode
        [odo] I0721 06:36:09.062686   18564 exec.go:96]    0: 00000000000000000000000000000000:0BB8 00000000000000000000000000000000:0000 0A 00000000:00000000 00:00000000 00000000 1002220000        0 380191170 1 0000000000000000 100 0 0 10 0
        [odo] I0721 06:36:09.062693   18564 exec.go:96]   sl  local_address                         remote_address                        st tx_queue rx_queue tr tm->when retrnsmt   uid  timeout inode ref pointer drops
        [odo] I0721 06:36:09.094228   18564 port.go:319] port 8080 not listening in container "runtime"
      << End Captured GinkgoWriter Output

      Spec Goroutine
      goroutine 239 [select, 2 minutes]
        github.com/onsi/gomega/internal.(*AsyncAssertion).match(0xc00027e3f0, {0x30f06e8?, 0xc0007f37a0}, 0x1, {0x0, 0x0, 0x0})
          /go/odo_1/vendor/github.com/onsi/gomega/internal/async_assertion.go:538
        github.com/onsi/gomega/internal.(*AsyncAssertion).Should(0xc00027e3f0, {0x30f06e8, 0xc0007f37a0}, {0x0, 0x0, 0x0})
          /go/odo_1/vendor/github.com/onsi/gomega/internal/async_assertion.go:145
        github.com/redhat-developer/odo/tests/helper.WaitForOutputToContain({0x2ce6933, 0x8}, 0xc0004bfdc0?, 0xc0004bfda0?, 0xc0007f36e0)
          /go/odo_1/tests/helper/helper_run.go:54
        github.com/redhat-developer/odo/tests/helper.(*DevSession).WaitSync(0xc0004b9380)
          /go/odo_1/tests/helper/helper_dev.go:274
      > github.com/redhat-developer/odo/tests/integration.glob..func7.5.1.1()
          /go/odo_1/tests/integration/cmd_dev_test.go:1039
            | 	helper.ReplaceStrings(filepath.Join(commonVar.Context, "devfile.yaml"), devfile.deploymentName, devfile.newDeploymentName)
            | 
            > 	err := devSession.WaitSync()
            | 	Expect(err).To(BeNil())
            | })
        github.com/onsi/ginkgo/v2/internal.extractBodyFunction.func3({0x1085f3e, 0xc0007c83c0})
          /go/odo_1/vendor/github.com/onsi/ginkgo/v2/internal/node.go:463
        github.com/onsi/ginkgo/v2/internal.(*Suite).runNode.func3()
          /go/odo_1/vendor/github.com/onsi/ginkgo/v2/internal/suite.go:863
        github.com/onsi/ginkgo/v2/internal.(*Suite).runNode
          /go/odo_1/vendor/github.com/onsi/ginkgo/v2/internal/suite.go:850
  ------------------------------
••SSSSS••SSS•
------------------------------
• [18.465 seconds]
odo dev interactive command tests when a component is bootstrapped should sync files when p is pressed
/go/odo_1/tests/integration/interactive_dev_test.go:206

  Captured StdOut/StdErr Output >>
  Spawning '/go/bin/odo dev --random-ports --no-watch' from /tmp/2218676507
  << Captured StdOut/StdErr Output
------------------------------
S•S•••SSS••S••SS•••SSS•SSS•SSS••SSS••SSSS•SS•SS•SS
------------------------------
• [2.848 seconds]
odo deploy interactive command tests directory is not empty when there is a match from Alizer should run alizer to download devfile successfully even with -v flag
/go/odo_1/tests/integration/interactive_deploy_test.go:40

  Captured StdOut/StdErr Output >>
  Spawning '/go/bin/odo deploy -v 4' from /tmp/3499567461
  << Captured StdOut/StdErr Output
------------------------------
•S•••S•SS•S••SS••SS•
  ------------------------------
  Progress Report for Ginkgo Process #6
  Automatically polling progress:
    odo dev debug command tests when a composite apply command is used as debug command should execute the composite apply commands successfully (Spec Runtime: 3m31.436s)
      /go/odo_1/tests/integration/cmd_dev_debug_test.go:288
      In [It] (Node Runtime: 2m0s)
        /go/odo_1/tests/integration/cmd_dev_debug_test.go:288
        At [By Step] cleaning up the resources on ending the session (Step Runtime: 27.053s)
          /go/odo_1/tests/integration/cmd_dev_debug_test.go:326

        Begin Captured GinkgoWriter Output >>
          ...
          [odo] I0721 06:38:07.842545   19842 execute_run.go:36] error while running background command: unable to exec command [/bin/sh -c echo $$ > /opt/odo/.odo_cmd_start-debug.pid && cd /projects &&  (npm run debug) 1>>/proc/1/fd/1 2>>/proc/1/fd/2; echo $? >> /opt/odo/.odo_cmd_start-debug.pid]: error while streaming command: context canceled
          [odo]  ✗  Finished executing the application (command: start-debug) [1m]
          [odo] I0721 06:38:07.846135   19842 implem.go:114] The path for preference file is /tmp/65871913/preference.yaml
          [odo] I0721 06:38:07.847534   19842 segment.go:268] Checking telemetry enable status
          [odo] I0721 06:38:07.847578   19842 segment.go:286] Sending telemetry disabled by env variable
          [odo] Cleaning resources, please wait
          [odo] I0721 06:38:07.969397   19842 all.go:46] starting to concurrently query 199 APIs
          [odo] I0721 06:38:07.969589   19842 all.go:62] fired up all goroutines to query APIs
          [odo] I0721 06:38:08.583917   19842 all.go:67] all goroutines have returned in 614.517321ms
          [odo] I0721 06:38:08.583979   19842 all.go:76] query result: objects=612
        << End Captured GinkgoWriter Output

        Spec Goroutine
        goroutine 127 [select]
          github.com/onsi/gomega/internal.(*AsyncAssertion).match(0xc0002780e0, {0x30f04a8?, 0xc0004c0678}, 0x1, {0x0, 0x0, 0x0})
            /go/odo_1/vendor/github.com/onsi/gomega/internal/async_assertion.go:538
          github.com/onsi/gomega/internal.(*AsyncAssertion).Should(0xc0002780e0, {0x30f04a8, 0xc0004c0678}, {0x0, 0x0, 0x0})
            /go/odo_1/vendor/github.com/onsi/gomega/internal/async_assertion.go:145
          github.com/onsi/gomega/gexec.(*Session).Wait(0xc0003c8420?, {0xc000602080?, 0x0?, 0x0?})
            /go/odo_1/vendor/github.com/onsi/gomega/gexec/session.go:144
          github.com/redhat-developer/odo/tests/helper.DevSession.WaitEnd(...)
            /go/odo_1/tests/helper/helper_dev.go:258
        > github.com/redhat-developer/odo/tests/integration.glob..func6.7.2.8()
            /go/odo_1/tests/integration/cmd_dev_debug_test.go:328
              | By("cleaning up the resources on ending the session", func() {
              | 	devSession.Stop()
              > 	devSession.WaitEnd()
              | 	out := commonVar.CliRunner.Run("get", "deployments").Out.Contents()
              | 	helper.DontMatchAllInOutput(string(out), deploymentNames)
          github.com/onsi/ginkgo/v2/internal.(*Suite).By(0xc00014c000, {0x2d46396, 0x2f}, {0xc001063e70, 0x1, 0x1?})
            /go/odo_1/vendor/github.com/onsi/ginkgo/v2/internal/suite.go:307
          github.com/onsi/ginkgo/v2.By({0x2d46396?, 0xc000d00000?}, {0xc001063e70?, 0xf717ee?, 0xf1d9a5?})
            /go/odo_1/vendor/github.com/onsi/ginkgo/v2/core_dsl.go:547
        > github.com/redhat-developer/odo/tests/integration.glob..func6.7.2()
            /go/odo_1/tests/integration/cmd_dev_debug_test.go:326
              | })
              | 
              > By("cleaning up the resources on ending the session", func() {
              | 	devSession.Stop()
              | 	devSession.WaitEnd()
          github.com/onsi/ginkgo/v2/internal.extractBodyFunction.func3({0xc0007cce40, 0xc000965ae8})
            /go/odo_1/vendor/github.com/onsi/ginkgo/v2/internal/node.go:463
          github.com/onsi/ginkgo/v2/internal.(*Suite).runNode.func3()
            /go/odo_1/vendor/github.com/onsi/ginkgo/v2/internal/suite.go:863
          github.com/onsi/ginkgo/v2/internal.(*Suite).runNode
            /go/odo_1/vendor/github.com/onsi/ginkgo/v2/internal/suite.go:850
  ------------------------------
•••S••SSS•S•SSS••SS•SS•S••SS••SSS•S••SS•SSS••SSSSSS•S•SSSS••S•S•••S•SSSS
------------------------------
• [56.496 seconds]
odo dev command tests when a component with multiple endpoints is run should create state files containing information, including forwarded ports
/go/odo_1/tests/integration/cmd_dev_test.go:3592

  Captured StdOut/StdErr Output >>
  PID: 24500
  << Captured StdOut/StdErr Output
------------------------------
S•S••S••S•SS•S••S•S•S•SSSSS•SS•SS•S•SS••SS•SSS•S•S••SSS•SSSS•S•S••S•S•S••SS•S••SS•S•••S•SSSSSS•SSS
------------------------------
• [2.145 seconds]
odo deploy interactive command tests directory is not empty when Alizer cannot determine a Devfile based on the current source code should not fail but fallback to the interactive mode
/go/odo_1/tests/integration/interactive_deploy_test.go:159

  Captured StdOut/StdErr Output >>
  Spawning '/go/bin/odo deploy' from /tmp/4288995401
  << Captured StdOut/StdErr Output
------------------------------
SSSS••S•S•S•SS••S•S•SSSSSSSS••SS•••S•SSSS••SSSSSS••SSS•SS•••SSS••SS•S••SS•S•••••S•SSSS•
------------------------------
• [77.964 seconds]
odo dev interactive command tests directory is not empty when there is a match from Alizer should run alizer to download devfile
/go/odo_1/tests/integration/interactive_dev_test.go:76

  Captured StdOut/StdErr Output >>
  Spawning '/go/bin/odo dev --random-ports' from /tmp/2598643222
  << Captured StdOut/StdErr Output
------------------------------
SS•SSSSSS•SSSSS••S••S•••SSS•S
------------------------------
• [54.259 seconds]
odo dev command with api server tests when the component is bootstrapped when odo dev is run with --api-server flag when /instance endpoint is DELETEd should terminate the dev session
/go/odo_1/tests/integration/cmd_dev_api_server_test.go:244

  Captured StdOut/StdErr Output >>
  <<< Session terminated >>>
  << Captured StdOut/StdErr Output
------------------------------
•SS•SSS•S••S••S•••S•SS•S•SSS••S•S•SSS•SS•S•S•S•S••S••S••••SSSS•SSSS•SSSSSS
------------------------------
• [2.678 seconds]
odo deploy interactive command tests directory is not empty when there is a match from Alizer should display welcoming messages first
/go/odo_1/tests/integration/interactive_deploy_test.go:109

  Captured StdOut/StdErr Output >>
  Spawning '/go/bin/odo deploy' from /tmp/1551145819
  << Captured StdOut/StdErr Output
------------------------------
S•S•S••••SS•SSSSSS•SSSSS•SSSSSSSS•S•SS•SSS•••SS•S•SS•••SSSSSSS•••SSS•SS••S•S•S••S•SSSS•SS•S••SS•S••S•S••S••••SSS•S•SSS•••••SS•S•SSSS••••SSSS•••SS••S••S•SS•••S•SSSSSS•S•••S•SSS•S•S•S•SSSSSSS•S•S•S•S••••S•S••SS••SSS••••••••••••••
  ------------------------------
  Progress Report for Ginkgo Process #6
  Automatically polling progress:
    odo dev command tests Devfile contains pod-overrides and container-overrides attributes should override the content in the pod it creates for the component on the cluster (Spec Runtime: 2m1.442s)
      /go/odo_1/tests/integration/cmd_dev_test.go:4116
      In [It] (Node Runtime: 2m0.001s)
        /go/odo_1/tests/integration/cmd_dev_test.go:4116

      Begin Captured GinkgoWriter Output >>
        ...
        [odo] I0721 06:51:31.835608    8453 execute_run.go:36] error while running background command: unable to exec command [/bin/sh -c echo $$ > /opt/odo/.odo_cmd_run.pid && cd ${PROJECT_SOURCE} &&  (npm start) 1>>/proc/1/fd/1 2>>/proc/1/fd/2; echo $? >> /opt/odo/.odo_cmd_run.pid]: error while streaming command: context canceled
        [odo]  ✗  Finished executing the application (command: run) [1m]
        [odo] I0721 06:51:31.842222    8453 implem.go:114] The path for preference file is /tmp/1323308781/preference.yaml
        [odo] Cleaning resources, please wait
        [odo] I0721 06:51:31.843173    8453 segment.go:268] Checking telemetry enable status
        [odo] I0721 06:51:31.843204    8453 segment.go:286] Sending telemetry disabled by env variable
        [odo] I0721 06:51:31.905114    8453 all.go:46] starting to concurrently query 199 APIs
        [odo] I0721 06:51:31.905336    8453 all.go:62] fired up all goroutines to query APIs
        [odo] I0721 06:51:32.474077    8453 all.go:67] all goroutines have returned in 568.974743ms
        [odo] I0721 06:51:32.474181    8453 all.go:76] query result: objects=575
      << End Captured GinkgoWriter Output

      Spec Goroutine
      goroutine 598 [select]
        github.com/onsi/gomega/internal.(*AsyncAssertion).match(0xc0002befc0, {0x30f04a8?, 0xc000b82798}, 0x1, {0x0, 0x0, 0x0})
          /go/odo_1/vendor/github.com/onsi/gomega/internal/async_assertion.go:538
        github.com/onsi/gomega/internal.(*AsyncAssertion).Should(0xc0002befc0, {0x30f04a8, 0xc000b82798}, {0x0, 0x0, 0x0})
          /go/odo_1/vendor/github.com/onsi/gomega/internal/async_assertion.go:145
        github.com/onsi/gomega/gexec.(*Session).Wait(0xc0012c1d70?, {0xc0007d4450?, 0x2ce86de?, 0x9?})
          /go/odo_1/vendor/github.com/onsi/gomega/gexec/session.go:144
        github.com/redhat-developer/odo/tests/helper.DevSession.WaitEnd(...)
          /go/odo_1/tests/helper/helper_dev.go:258
        github.com/redhat-developer/odo/tests/helper.RunDevMode.func1()
          /go/odo_1/tests/helper/helper_dev.go:329
        github.com/redhat-developer/odo/tests/helper.RunDevMode({{0x0, 0x0, 0x0}, {0x0, 0x0, 0x0}, 0x0, 0x0, 0x0, 0x0, ...}, ...)
          /go/odo_1/tests/helper/helper_dev.go:332
      > github.com/redhat-developer/odo/tests/integration.glob..func7.64.2()
          /go/odo_1/tests/integration/cmd_dev_test.go:4117
            | })
            | It("should override the content in the pod it creates for the component on the cluster", func() {
            > 	err := helper.RunDevMode(helper.DevSessionOpts{
            | 		RunOnPodman: ctx.podman,
            | 	}, func(session *gexec.Session, outContents, _ string, _ map[string]string) {
        github.com/onsi/ginkgo/v2/internal.extractBodyFunction.func3({0xc000ad41e0, 0xc000da7d10})
          /go/odo_1/vendor/github.com/onsi/ginkgo/v2/internal/node.go:463
        github.com/onsi/ginkgo/v2/internal.(*Suite).runNode.func3()
          /go/odo_1/vendor/github.com/onsi/ginkgo/v2/internal/suite.go:863
        github.com/onsi/ginkgo/v2/internal.(*Suite).runNode
          /go/odo_1/vendor/github.com/onsi/ginkgo/v2/internal/suite.go:850
  ------------------------------
•

Ran 407 of 958 Specs in 1339.706 seconds
SUCCESS! -- 407 Passed | 0 Failed | 0 Pending | 551 Skipped


Ginkgo ran 1 suite in 23m23.47280739s
Test Suite Passed
go run -mod=vendor github.com/onsi/ginkgo/v2/ginkgo  --randomize-all --poll-progress-after=120s --poll-progress-interval=120s -timeout 14400s --no-color -nodes=16 --junit-report="test-e2e.xml"  tests/e2escenarios
Running Suite: odo e2e scenarios - /go/odo_1/tests/e2escenarios
===============================================================
Random Seed: 1689922333 - will randomize all specs

Will run 4 of 4 specs
Running in parallel across 16 processes
------------------------------
• [103.935 seconds]
E2E Test starting with non-empty Directory test debugging should verify developer workflow from non-empty Directory
/go/odo_1/tests/e2escenarios/e2e_test.go:326

  Captured StdOut/StdErr Output >>
  Spawning '/go/bin/odo init' from /tmp/2521707719
  << Captured StdOut/StdErr Output
------------------------------
  Progress Report for Ginkgo Process #7
  Automatically polling progress:
    E2E Test starting with non-empty Directory should verify developer workflow from non-empty Directory (Spec Runtime: 2m2.143s)
      /go/odo_1/tests/e2escenarios/e2e_test.go:196
      In [It] (Node Runtime: 2m0.001s)
        /go/odo_1/tests/e2escenarios/e2e_test.go:196

      Begin Captured GinkgoWriter Output >>
        ...
        [odo]  ✗  Finished executing the application (command: run) [26s]
        [odo] I0721 06:54:27.035509    9258 execute_run.go:36] error while running background command: unable to exec command [/bin/sh -c echo $$ > /opt/odo/.odo_cmd_run.pid && cd ${PROJECT_SOURCE} &&  (mvn -Dmaven.repo.local=/home/user/.m2/repository spring-boot:run) 1>>/proc/1/fd/1 2>>/proc/1/fd/2; echo $? >> /opt/odo/.odo_cmd_run.pid]: error while streaming command: context canceled
        [odo] I0721 06:54:27.042208    9258 implem.go:114] The path for preference file is /tmp/2319636969/preference.yaml
        [odo] Cleaning resources, please wait
        [odo] I0721 06:54:27.043319    9258 segment.go:268] Checking telemetry enable status
        [odo] I0721 06:54:27.043346    9258 segment.go:286] Sending telemetry disabled by env variable
        [odo] I0721 06:54:27.158283    9258 all.go:46] starting to concurrently query 199 APIs
        [odo] I0721 06:54:27.158665    9258 all.go:62] fired up all goroutines to query APIs
        [odo] I0721 06:54:27.739220    9258 all.go:67] all goroutines have returned in 580.953995ms
        [odo] I0721 06:54:27.739289    9258 all.go:76] query result: objects=583
      << End Captured GinkgoWriter Output

      Spec Goroutine
      goroutine 49 [select]
        github.com/onsi/gomega/internal.(*AsyncAssertion).match(0xc00034d650, {0x2f34db0?, 0xc000656a38}, 0x1, {0x0, 0x0, 0x0})
          /go/odo_1/vendor/github.com/onsi/gomega/internal/async_assertion.go:538
        github.com/onsi/gomega/internal.(*AsyncAssertion).Should(0xc00034d650, {0x2f34db0, 0xc000656a38}, {0x0, 0x0, 0x0})
          /go/odo_1/vendor/github.com/onsi/gomega/internal/async_assertion.go:145
        github.com/onsi/gomega/gexec.(*Session).Wait(0xc00098dd28?, {0xc000664d50?, 0xc00098dc18?, 0x3?})
          /go/odo_1/vendor/github.com/onsi/gomega/gexec/session.go:144
        github.com/redhat-developer/odo/tests/helper.DevSession.WaitEnd(...)
          /go/odo_1/tests/helper/helper_dev.go:258
      > github.com/redhat-developer/odo/tests/e2escenarios.glob..func1.6.2()
          /go/odo_1/tests/e2escenarios/e2e_test.go:255
            | // "exit dev mode and run odo deploy"
            | devSession.Stop()
            > devSession.WaitEnd()
            | 
            | // all resources should be deleted from the namespace
        github.com/onsi/ginkgo/v2/internal.extractBodyFunction.func3({0x1038705, 0xc00006a2a0})
          /go/odo_1/vendor/github.com/onsi/ginkgo/v2/internal/node.go:463
        github.com/onsi/ginkgo/v2/internal.(*Suite).runNode.func3()
          /go/odo_1/vendor/github.com/onsi/ginkgo/v2/internal/suite.go:863
        github.com/onsi/ginkgo/v2/internal.(*Suite).runNode
          /go/odo_1/vendor/github.com/onsi/ginkgo/v2/internal/suite.go:850
  ------------------------------
  Progress Report for Ginkgo Process #2
  Automatically polling progress:
    E2E Test starting with empty Directory should verify developer workflow from empty Directory (Spec Runtime: 2m2.404s)
      /go/odo_1/tests/e2escenarios/e2e_test.go:63
      In [It] (Node Runtime: 2m0s)
        /go/odo_1/tests/e2escenarios/e2e_test.go:63

      Begin Captured GinkgoWriter Output >>
        ...
        [odo] [Ctrl+c] - Exit and delete resources from the cluster
        [odo]      [p] - Manually apply local changes to the application on the cluster
        [odo] I0721 06:54:26.690623    9552 status.go:34] setting inner loop State "Ready"
        [odo] I0721 06:54:26.690681    9552 watch.go:267] deployment watcher Event: Type: MODIFIED, name: bduuas-app, rv: 27202320, generation: 1, pods: 1
        [odo] I0721 06:54:26.796233    9552 watch.go:344] filesystem watch event: REMOVE        "/tmp/240151703/.odo/odo-file-index.json"
        [odo] I0721 06:54:26.796532    9552 watch.go:379] error removing watch for /tmp/240151703/.odo/odo-file-index.json: can't remove non-existent watcher: /tmp/240151703/.odo/odo-file-index.json
        [odo] I0721 06:54:26.796637    9552 watch.go:344] filesystem watch event: CREATE        "/tmp/240151703/.odo/odo-file-index.json"
        [odo] I0721 06:54:26.804163    9552 watch.go:344] filesystem watch event: WRITE         "/tmp/240151703/.odo/odo-file-index.json"
        [odo] I0721 06:54:26.808320    9552 watch.go:344] filesystem watch event: WRITE         "/tmp/240151703/.odo/devstate.json"
        [odo] I0721 06:54:26.812455    9552 watch.go:344] filesystem watch event: WRITE         "/tmp/240151703/.odo/devstate.9552.json"
      << End Captured GinkgoWriter Output

      Spec Goroutine
      goroutine 70 [select, 1 minutes]
        github.com/onsi/gomega/internal.(*AsyncAssertion).match(0xc000037d50, {0x2f34ed0?, 0xc000c97f50}, 0x1, {0x0, 0x0, 0x0})
          /go/odo_1/vendor/github.com/onsi/gomega/internal/async_assertion.go:538
        github.com/onsi/gomega/internal.(*AsyncAssertion).Should(0xc000037d50, {0x2f34ed0, 0xc000c97f50}, {0x0, 0x0, 0x0})
          /go/odo_1/vendor/github.com/onsi/gomega/internal/async_assertion.go:145
        github.com/redhat-developer/odo/tests/helper.WaitForOutputToContain({0x2b660a4, 0xf}, 0x0?, 0x2?, 0xc000c97f20)
          /go/odo_1/tests/helper/helper_run.go:54
        github.com/redhat-developer/odo/tests/helper.StartDevMode({{0x0, 0x0, 0x0}, {0x0, 0x0, 0x0}, 0x0, 0x0, 0x0, 0x0, ...})
          /go/odo_1/tests/helper/helper_dev.go:190
      > github.com/redhat-developer/odo/tests/e2escenarios.glob..func1.5.2()
          /go/odo_1/tests/e2escenarios/e2e_test.go:152
            | 
            | // start dev mode again
            > devSession, err = helper.StartDevMode(helper.DevSessionOpts{})
            | Expect(err).ToNot(HaveOccurred())
            | 
        github.com/onsi/ginkgo/v2/internal.extractBodyFunction.func3({0x103871e, 0xc000390540})
          /go/odo_1/vendor/github.com/onsi/ginkgo/v2/internal/node.go:463
        github.com/onsi/ginkgo/v2/internal.(*Suite).runNode.func3()
          /go/odo_1/vendor/github.com/onsi/ginkgo/v2/internal/suite.go:863
        github.com/onsi/ginkgo/v2/internal.(*Suite).runNode
          /go/odo_1/vendor/github.com/onsi/ginkgo/v2/internal/suite.go:850
  ------------------------------
  Progress Report for Ginkgo Process #8
  Automatically polling progress:
    E2E Test starting with non-empty Directory add Binding should verify developer workflow of using binding as env in innerloop (Spec Runtime: 2m6.631s)
      /go/odo_1/tests/e2escenarios/e2e_test.go:458
      In [It] (Node Runtime: 2m0.001s)
        /go/odo_1/tests/e2escenarios/e2e_test.go:458

      Begin Captured GinkgoWriter Output >>
        ...
        [odo] I0721 06:54:36.357572    9325 schema.go:61] validated devfile schema
        [odo] I0721 06:54:36.358018    9325 validate.go:45] Successfully validated devfile sections
        [odo] I0721 06:54:36.358091    9325 components.go:69] component state: "SyncOutdated"
        [odo]  •  Waiting for Kubernetes resources  ...
        [odo] I0721 06:54:36.364242    9325 components.go:260] We are deploying these annotations: map[alpha.image.policy.openshift.io/resolve-names:* odo.dev/project-type:Go]
        [odo] I0721 06:54:36.384961    9325 utils.go:77] Updating container runtime with mandatory volume mounts
        [odo] I0721 06:54:36.405110    9325 components.go:346] Creating deployment gxkmhy-app
        [odo] I0721 06:54:36.405146    9325 components.go:347] The component name is gxkmhy
        [odo] I0721 06:54:36.405162    9325 components.go:350] The component already exists, attempting to update it
        [odo] I0721 06:54:36.405219    9325 components.go:352] Applying deployment
      << End Captured GinkgoWriter Output

      Spec Goroutine
      goroutine 65 [select]
        github.com/onsi/gomega/internal.(*AsyncAssertion).match(0xc0004c44d0, {0x2f34ed0?, 0xc0002f4de0}, 0x1, {0x0, 0x0, 0x0})
          /go/odo_1/vendor/github.com/onsi/gomega/internal/async_assertion.go:538
        github.com/onsi/gomega/internal.(*AsyncAssertion).Should(0xc0004c44d0, {0x2f34ed0, 0xc0002f4de0}, {0x0, 0x0, 0x0})
          /go/odo_1/vendor/github.com/onsi/gomega/internal/async_assertion.go:145
        github.com/redhat-developer/odo/tests/helper.WaitForOutputToContain({0x2b580b9, 0x8}, 0x0?, 0x48?, 0xc000498f30)
          /go/odo_1/tests/helper/helper_run.go:54
        github.com/redhat-developer/odo/tests/helper.(*DevSession).WaitSync(0xc0006f9e28)
          /go/odo_1/tests/helper/helper_dev.go:274
      > github.com/redhat-developer/odo/tests/e2escenarios.glob..func1.8.4()
          /go/odo_1/tests/e2escenarios/e2e_test.go:523
            | helper.Cmd("odo", "remove", "binding", "--name", bindingName).ShouldPass()
            | 
            > err = devSession.WaitSync()
            | Expect(err).To(BeNil())
            | Eventually(func() string { return helper.Cmd("odo", "describe", "binding").ShouldRun().Out() }).
        github.com/onsi/ginkgo/v2/internal.extractBodyFunction.func3({0x103871e, 0xc000198cc0})
          /go/odo_1/vendor/github.com/onsi/ginkgo/v2/internal/node.go:463
        github.com/onsi/ginkgo/v2/internal.(*Suite).runNode.func3()
          /go/odo_1/vendor/github.com/onsi/ginkgo/v2/internal/suite.go:863
        github.com/onsi/ginkgo/v2/internal.(*Suite).runNode
          /go/odo_1/vendor/github.com/onsi/ginkgo/v2/internal/suite.go:850
  ------------------------------
• [146.540 seconds]
E2E Test starting with empty Directory should verify developer workflow from empty Directory
/go/odo_1/tests/e2escenarios/e2e_test.go:63

  Captured StdOut/StdErr Output >>
  Spawning '/go/bin/odo init' from /tmp/240151703
  Spawning '/go/bin/odo delete component' from /tmp/240151703
  << Captured StdOut/StdErr Output
------------------------------
• [165.368 seconds]
E2E Test starting with non-empty Directory add Binding should verify developer workflow of using binding as env in innerloop
/go/odo_1/tests/e2escenarios/e2e_test.go:458

  Captured StdOut/StdErr Output >>
  Spawning '/go/bin/odo init' from /tmp/3128079404
  << Captured StdOut/StdErr Output
------------------------------
• [237.379 seconds]
E2E Test starting with non-empty Directory should verify developer workflow from non-empty Directory
/go/odo_1/tests/e2escenarios/e2e_test.go:196

  Captured StdOut/StdErr Output >>
  Spawning '/go/bin/odo init' from /tmp/339881583
  Spawning '/go/bin/odo delete component' from /tmp/339881583
  << Captured StdOut/StdErr Output
------------------------------

Ran 4 of 4 Specs in 237.386 seconds
SUCCESS! -- 4 Passed | 0 Failed | 0 Pending | 0 Skipped


Ginkgo ran 1 suite in 4m13.77085465s
Test Suite Passed